{"text_format":"1","workbook":"xlsx","n_sheets":13,"sheets":["説明書","従業者名簿","給与計算","給与明細","賞与計算","賞与明細","振替伝票","保険料額表","年末調整金種計算","台帳合計表","台帳原本","賞与算出表","年末調整計算"],"not_rendered":{"charts":0,"images":0,"macros":1,"external_links":0,"defined_names":66,"comments":3,"pivot_tables":0},"unopened":[],"bounds":{"document_bytes":16777216,"sheet_cells":100000,"rows_first":2000,"rows_last":500,"rows_between":2000,"halvings":0,"cell_chars":16384,"cell_head_chars":4096},"cells_cut":0,"cells_raw":0,"read":"whole","date_system":"1900"}

{"sheet":"説明書","index":0,"n_rows":39,"n_cols":4,"rows_kept":39,"cut":false,"hidden":false,"merged":[[0,0,0,3]]}
["給与計算ワークシート説明書"]
[]
[null,null,"注意","必ずマクロ機能をオンにして使ってください。"]
[]
["①","印刷用の設定","①-1","給与計算（一覧表）、給与明細、賞与計算（一覧表）、賞与明細のシートをプリンタに合わせて印刷テストしておきます。"]
[null,null,"①-2","台帳原本は、複製して利用するので台帳を作成する前に、プリンタに合わせて印刷設定しておきましょう。"]
[]
["②","各計算表の設定","②-1","保険料額表の雇用保険、社会保険、健康保険の料率を設定します。"]
{"$rows_left_out":32}
{"sheet":"従業者名簿","index":1,"n_rows":33,"n_cols":16,"rows_kept":33,"cut":false,"hidden":false,"merged":[[0,0,0,2]]}
["従業者名簿"]
[]
[null,2015,"年度分","企業名：","株式会社○○△△"]
[]
["シート番号","区分","従業者番号","入社日","役職","氏名","生年月日","年齢","郵便番号","住所1","住所2","電話番号","基礎年金番号","介護保険","雇用保険番号","振込先"]
[1,2,1,"2000-01-01",null,"A","1970-09-10",{"$f":"IF(G6=\"\",\"\",DATEDIF(G6,TODAY(),\"Y\"))","v":44},"111-1111","東京都",null,"03-0999-9999","9999-1111",{"$f":"IF($B$3-YEAR(G6)<40,\"-\",IF($B$3-YEAR(G6)<65,\"該当\",\"-\"))","v":"該当"},null,"テストデータ"]
[2,2,2,"2000-01-01",null,"B","1988-03-16",{"$f":"IF(G7=\"\",\"\",DATEDIF(G7,TODAY(),\"Y\"))","v":27},"222-2222","埼玉県",null,null,"9999-2222","-","9999-2222","テストデータ"]
[3,2,3,"2000-01-01",null,"C","1980-01-11",{"$f":"IF(G8=\"\",\"\",DATEDIF(G8,TODAY(),\"Y\"))","v":35},"333-3333","埼玉県",null,null,"9999-3333","-","9999-3333","テストデータ"]
{"$rows_left_out":26}
{"sheet":"給与計算","index":2,"n_rows":77,"n_cols":21,"rows_kept":77,"cut":false,"hidden":false,"merged":[[34,13,34,14],[2,16,2,17],[3,16,5,17]]}
[null,"シート番号",1,2,3,4,5,6,7,8,9,10,null,null,null,null,"処理列数",{"$f":"COUNTA(B2:M2)-2","v":10}]
[1,{"$f":"NOW()","v":"2015-09-06T08:53:19.380"},{"$f":"T(VLOOKUP(C$1,従業者一覧表,6))","v":"A"},"B","C","D","E","","","","","","合計",null,"A4用紙"]
[2,"基本給与",null,null,null,null,null,null,null,null,null,null,{"$f":"SUM(C3:L3)","v":0},null,null,null,"今月の注意事項",null,null,{"$f":"MONTH(NOW())","v":9},{"$f":"T(VLOOKUP(T3,T4:U15,2))","v":""}]
[3,"役員報酬",null,null,null,null,null,null,null,null,null,null,0,null,null,null,{"$f":"U3","v":""},null,null,1]
[4,"家族手当",null,null,null,null,null,null,null,null,null,null,0,null,null,null,null,null,null,2]
[5,"住宅手当",null,null,null,null,null,null,null,null,null,null,0,null,null,null,null,null,null,3]
[6,"資格手当",null,null,null,null,null,null,null,null,null,null,0,null,null,null,null,null,null,4,"給与見直"]
[7,"技能手当",null,null,null,null,null,null,null,null,null,null,0,null,{"$f":"IF(M31=U17,\"転記済\",\"転記必要\")","v":"転記済"},null,null,"改訂",null,5]
{"$rows_left_out":70}
{"sheet":"給与明細","index":3,"n_rows":33,"n_cols":39,"rows_kept":33,"cut":false,"hidden":false,"merged":[]}
[null,"列番号",1,null,null,null,2,null,null,null,3,null,null,null,4,null,null,null,5,null,null,null,6,null,null,null,7,null,null,null,8,null,null,null,9,null,null,null,10]
[null,"●●●●●","●●●●●",null,null,"●●●●●","●●●●●",null,null,"●●●●●","●●●●●",null,null,"●●●●●","●●●●●",null,null,"●●●●●","●●●●●",null,null,"●●●●●","●●●●●",null,null,"●●●●●","●●●●●",null,null,"●●●●●","●●●●●",null,null,"●●●●●","●●●●●",null,null,"●●●●●","●●●●●"]
[null,{"$f":"給与計算!$B$2","v":"2015-09-06T08:53:19.380"},null,null,null,{"$f":"給与計算!$B$2","v":"2015-09-06T08:53:19.380"},null,null,null,{"$f":"給与計算!$B$2","v":"2015-09-06T08:53:19.380"},null,null,null,{"$f":"給与計算!$B$2","v":"2015-09-06T08:53:19.380"},null,null,null,{"$f":"給与計算!$B$2","v":"2015-09-06T08:53:19.380"},null,null,null,{"$f":"給与計算!$B$2","v":"2015-09-06T08:53:19.380"},null,null,null,{"$f":"給与計算!$B$2","v":"2015-09-06T08:53:19.380"},null,null,null,{"$f":"給与計算!$B$2","v":"2015-09-06T08:53:19.380"},null,null,null,{"$f":"給与計算!$B$2","v":"2015-09-06T08:53:19.380"},null,null,null,{"$f":"給与計算!$B$2","v":"2015-09-06T08:53:19.380"}]
[null,"給与明細",null,null,null,"給与明細",null,null,null,"給与明細",null,null,null,"給与明細",null,null,null,"給与明細",null,null,null,"給与明細",null,null,null,"給与明細",null,null,null,"給与明細",null,null,null,"給与明細",null,null,null,"給与明細"]
[]
[1,{"$f":"INDEX(給与計算!_xlnm.Print_Area,$A6,C1+1)","v":"A"},null,null,null,{"$f":"INDEX(給与計算!_xlnm.Print_Area,$A6,G1+1)","v":"B"},null,null,null,{"$f":"INDEX(給与計算!_xlnm.Print_Area,$A6,K1+1)","v":"C"},null,null,null,{"$f":"INDEX(給与計算!_xlnm.Print_Area,$A6,O1+1)","v":"D"},null,null,null,{"$f":"INDEX(給与計算!_xlnm.Print_Area,$A6,S1+1)","v":"E"},null,null,null,{"$f":"INDEX(給与計算!_xlnm.Print_Area,$A6,W1+1)","v":""},null,null,null,{"$f":"INDEX(給与計算!_xlnm.Print_Area,$A6,AA1+1)","v":""},null,null,null,{"$f":"INDEX(給与計算!_xlnm.Print_Area,$A6,AE1+1)","v":""},null,null,null,{"$f":"INDEX(給与計算!_xlnm.Print_Area,$A6,AI1+1)","v":""},null,null,null,{"$f":"INDEX(給与計算!_xlnm.Print_Area,$A6,AM1+1)","v":""}]
[2,{"$f":"INDEX(給与計算!_xlnm.Print_Area,$A7,1)","v":"基本給与"},{"$f":"INDEX(給与計算!_xlnm.Print_Area,$A7,C$1+1)","v":0},null,null,{"$f":"INDEX(給与計算!_xlnm.Print_Area,$A7,1)","v":"基本給与"},{"$f":"INDEX(給与計算!_xlnm.Print_Area,$A7,G$1+1)","v":0},null,null,{"$f":"INDEX(給与計算!_xlnm.Print_Area,$A7,1)","v":"基本給与"},{"$f":"INDEX(給与計算!_xlnm.Print_Area,$A7,K$1+1)","v":0},null,null,{"$f":"INDEX(給与計算!_xlnm.Print_Area,$A7,1)","v":"基本給与"},{"$f":"INDEX(給与計算!_xlnm.Print_Area,$A7,O$1+1)","v":0},null,null,{"$f":"INDEX(給与計算!_xlnm.Print_Area,$A7,1)","v":"基本給与"},{"$f":"INDEX(給与計算!_xlnm.Print_Area,$A7,S$1+1)","v":0},null,null,{"$f":"INDEX(給与計算!_xlnm.Print_Area,$A7,1)","v":"基本給与"},{"$f":"INDEX(給与計算!_xlnm.Print_Area,$A7,W$1+1)","v":0},null,null,{"$f":"INDEX(給与計算!_xlnm.Print_Area,$A7,1)","v":"基本給与"},{"$f":"INDEX(給与計算!_xlnm.Print_Area,$A7,AA$1+1)","v":0},null,null,{"$f":"INDEX(給与計算!_xlnm.Print_Area,$A7,1)","v":"基本給与"},{"$f":"INDEX(給与計算!_xlnm.Print_Area,$A7,AE$1+1)","v":0},null,null,{"$f":"INDEX(給与計算!_xlnm.Print_Area,$A7,1)","v":"基本給与"},{"$f":"INDEX(給与計算!_xlnm.Print_Area,$A7,AI$1+1)","v":0},null,null,{"$f":"INDEX(給与計算!_xlnm.Print_Area,$A7,1)","v":"基本給与"},{"$f":"INDEX(給与計算!_xlnm.Print_Area,$A7,AM$1+1)","v":0}]
[3,{"$f":"INDEX(給与計算!_xlnm.Print_Area,$A8,1)","v":"役員報酬"},{"$f":"INDEX(給与計算!_xlnm.Print_Area,$A8,C$1+1)","v":0},null,null,{"$f":"INDEX(給与計算!_xlnm.Print_Area,$A8,1)","v":"役員報酬"},{"$f":"INDEX(給与計算!_xlnm.Print_Area,$A8,G$1+1)","v":0},null,null,{"$f":"INDEX(給与計算!_xlnm.Print_Area,$A8,1)","v":"役員報酬"},{"$f":"INDEX(給与計算!_xlnm.Print_Area,$A8,K$1+1)","v":0},null,null,{"$f":"INDEX(給与計算!_xlnm.Print_Area,$A8,1)","v":"役員報酬"},{"$f":"INDEX(給与計算!_xlnm.Print_Area,$A8,O$1+1)","v":0},null,null,{"$f":"INDEX(給与計算!_xlnm.Print_Area,$A8,1)","v":"役員報酬"},{"$f":"INDEX(給与計算!_xlnm.Print_Area,$A8,S$1+1)","v":0},null,null,{"$f":"INDEX(給与計算!_xlnm.Print_Area,$A8,1)","v":"役員報酬"},{"$f":"INDEX(給与計算!_xlnm.Print_Area,$A8,W$1+1)","v":0},null,null,{"$f":"INDEX(給与計算!_xlnm.Print_Area,$A8,1)","v":"役員報酬"},{"$f":"INDEX(給与計算!_xlnm.Print_Area,$A8,AA$1+1)","v":0},null,null,{"$f":"INDEX(給与計算!_xlnm.Print_Area,$A8,1)","v":"役員報酬"},{"$f":"INDEX(給与計算!_xlnm.Print_Area,$A8,AE$1+1)","v":0},null,null,{"$f":"INDEX(給与計算!_xlnm.Print_Area,$A8,1)","v":"役員報酬"},{"$f":"INDEX(給与計算!_xlnm.Print_Area,$A8,AI$1+1)","v":0},null,null,{"$f":"INDEX(給与計算!_xlnm.Print_Area,$A8,1)","v":"役員報酬"},{"$f":"INDEX(給与計算!_xlnm.Print_Area,$A8,AM$1+1)","v":0}]
{"$rows_left_out":26}
{"sheet":"賞与計算","index":4,"n_rows":64,"n_cols":18,"rows_kept":64,"cut":false,"hidden":false,"merged":[[0,2,0,3]]}
[1,"基礎計算",{"$f":"\"平成\"&(YEAR(NOW())-1988)&\"年\"&IF(AND(MONTH(NOW())<11,MONTH(NOW())>5),\"夏期\",\"冬期\")","v":"平成27年夏期"}]
[]
[null,"半期売上",null,"千円",null,null,"還元額",{"$f":"C3*C4*1000","v":0},"円"]
[null,"還元率",0.05,null,3,"人","一人当たり",{"$f":"INT(H3/E4/100)*100","v":0},"円"]
[]
[6,null,{"$f":"IF(C$31=VLOOKUP(C$31,従業者一覧表,1),VLOOKUP(C$31,従業者一覧表,6),\"\")","v":"A"},"B","C","D","E",0,0,0,0,0,"合計",null,{"$f":"IF(M28=N30,\"OK\",\"NO\")","v":"OK"}]
[null,"売上還元額",{"$f":"$H$4*C11","v":0},{"$f":"$H$4*D11","v":0},{"$f":"$H$4*E11","v":0},{"$f":"$H$4*F11","v":0},0,0,{"$f":"$H$4*I11","v":0},{"$f":"$H$4*J11","v":0},{"$f":"$H$4*K11","v":0},{"$f":"$H$4*L11","v":0},{"$f":"SUM(D7:L7)","v":0},"円","金種表"]
[null,"個別売上",1000,2000,null,null,null,null,null,null,null,null,{"$f":"SUM(D8:L8)","v":2000},"千円",10000,{"$f":"M34","v":0},{"$f":"P8*O8","v":0}]
{"$rows_left_out":57}
{"sheet":"賞与明細","index":5,"n_rows":31,"n_cols":39,"rows_kept":31,"cut":false,"hidden":false,"merged":[[20,1,20,2],[3,9,3,10],[3,13,3,14],[5,9,5,10],[5,13,5,14],[2,1,2,2],[3,1,3,2],[5,1,5,2],[2,21,2,22],[2,9,2,10],[2,13,2,14],[2,17,2,18],[5,5,5,6],[2,5,2,6],[5,21,5,22],[3,21,3,22],[3,17,3,18],[3,5,3,6],[5,17,5,18],[20,21,20,22],[20,5,20,6],[20,9,20,10],[20,13,20,14],[20,17,20,18],[2,25,2,26],[3,25,3,26],[5,25,5,26],[20,25,20,26],[2,29,2,30],[3,29,3,30],[5,29,5,30],[20,29,20,30],[2,33,2,34],[3,33,3,34],[5,33,5,34],[20,33,20,34],[2,37,2,38],[3,37,3,38],[5,37,5,38],[20,37,20,38]]}
[null,"列番号",1,null,null,null,2,null,null,null,3,null,null,null,4,null,null,null,5,null,null,null,6,null,null,null,7,null,null,null,8,null,null,null,9,null,null,null,10]
[null,"●●●●●","●●●●●",null,null,"●●●●●","●●●●●",null,null,"●●●●●","●●●●●",null,null,"●●●●●","●●●●●",null,null,"●●●●●","●●●●●",null,null,"●●●●●","●●●●●",null,null,"●●●●●","●●●●●",null,null,"●●●●●","●●●●●",null,null,"●●●●●","●●●●●",null,null,"●●●●●","●●●●●"]
[null,{"$f":"賞与計算!$C$1","v":"平成27年夏期"},null,null,null,{"$f":"賞与計算!$C$1","v":"平成27年夏期"},null,null,null,{"$f":"賞与計算!$C$1","v":"平成27年夏期"},null,null,null,{"$f":"賞与計算!$C$1","v":"平成27年夏期"},null,null,null,{"$f":"賞与計算!$C$1","v":"平成27年夏期"},null,null,null,{"$f":"賞与計算!$C$1","v":"平成27年夏期"},null,null,null,{"$f":"賞与計算!$C$1","v":"平成27年夏期"},null,null,null,{"$f":"賞与計算!$C$1","v":"平成27年夏期"},null,null,null,{"$f":"賞与計算!$C$1","v":"平成27年夏期"},null,null,null,{"$f":"賞与計算!$C$1","v":"平成27年夏期"}]
[null,"賞与明細",null,null,null,"賞与明細",null,null,null,"賞与明細",null,null,null,"賞与明細",null,null,null,"賞与明細",null,null,null,"賞与明細",null,null,null,"賞与明細",null,null,null,"賞与明細",null,null,null,"賞与明細",null,null,null,"賞与明細"]
[]
[6,{"$f":"INDEX(賞与計算!_xlnm.Print_Area,$A6,C1+1)","v":"A"},{"$f":"INDEX(給与計算!_xlnm.Print_Area,$B6,D1+1)","v":{"$error":"#VALUE!"}},null,null,{"$f":"INDEX(賞与計算!_xlnm.Print_Area,$A6,G1+1)","v":"B"},{"$f":"INDEX(給与計算!_xlnm.Print_Area,$B6,H1+1)","v":{"$error":"#VALUE!"}},null,null,{"$f":"INDEX(賞与計算!_xlnm.Print_Area,$A6,K1+1)","v":"C"},{"$f":"INDEX(給与計算!_xlnm.Print_Area,$B6,L1+1)","v":{"$error":"#VALUE!"}},null,null,{"$f":"INDEX(賞与計算!_xlnm.Print_Area,$A6,O1+1)","v":"D"},{"$f":"INDEX(給与計算!_xlnm.Print_Area,$B6,P1+1)","v":{"$error":"#VALUE!"}},null,null,{"$f":"INDEX(賞与計算!_xlnm.Print_Area,$A6,S1+1)","v":"E"},{"$f":"INDEX(給与計算!_xlnm.Print_Area,$B6,T1+1)","v":{"$error":"#VALUE!"}},null,null,{"$f":"INDEX(賞与計算!_xlnm.Print_Area,$A6,W1+1)","v":0},{"$f":"INDEX(給与計算!_xlnm.Print_Area,$B6,X1+1)","v":{"$error":"#VALUE!"}},null,null,{"$f":"INDEX(賞与計算!_xlnm.Print_Area,$A6,AA1+1)","v":0},{"$f":"INDEX(給与計算!_xlnm.Print_Area,$B6,AB1+1)","v":{"$error":"#VALUE!"}},null,null,{"$f":"INDEX(賞与計算!_xlnm.Print_Area,$A6,AE1+1)","v":0},{"$f":"INDEX(給与計算!_xlnm.Print_Area,$B6,AF1+1)","v":{"$error":"#VALUE!"}},null,null,{"$f":"INDEX(賞与計算!_xlnm.Print_Area,$A6,AI1+1)","v":0},{"$f":"INDEX(給与計算!_xlnm.Print_Area,$B6,AJ1+1)","v":{"$error":"#VALUE!"}},null,null,{"$f":"INDEX(賞与計算!_xlnm.Print_Area,$A6,AM1+1)","v":0},{"$f":"INDEX(給与計算!_xlnm.Print_Area,$B6,AN1+1)","v":{"$error":"#VALUE!"}}]
[14,{"$f":"INDEX(賞与計算!_xlnm.Print_Area,$A7,1)","v":"定額基礎"},{"$f":"INDEX(賞与計算!_xlnm.Print_Area,$A7,C$1+1)","v":0},null,null,{"$f":"INDEX(賞与計算!_xlnm.Print_Area,$A7,1)","v":"定額基礎"},{"$f":"INDEX(賞与計算!_xlnm.Print_Area,$A7,G$1+1)","v":0},null,null,{"$f":"INDEX(賞与計算!_xlnm.Print_Area,$A7,1)","v":"定額基礎"},{"$f":"INDEX(賞与計算!_xlnm.Print_Area,$A7,K$1+1)","v":0},null,null,{"$f":"INDEX(賞与計算!_xlnm.Print_Area,$A7,1)","v":"定額基礎"},{"$f":"INDEX(賞与計算!_xlnm.Print_Area,$A7,O$1+1)","v":0},null,null,{"$f":"INDEX(賞与計算!_xlnm.Print_Area,$A7,1)","v":"定額基礎"},{"$f":"INDEX(賞与計算!_xlnm.Print_Area,$A7,S$1+1)","v":0},null,null,{"$f":"INDEX(賞与計算!_xlnm.Print_Area,$A7,1)","v":"定額基礎"},{"$f":"INDEX(賞与計算!_xlnm.Print_Area,$A7,W$1+1)","v":0},null,null,{"$f":"INDEX(賞与計算!_xlnm.Print_Area,$A7,1)","v":"定額基礎"},{"$f":"INDEX(賞与計算!_xlnm.Print_Area,$A7,AA$1+1)","v":0},null,null,{"$f":"INDEX(賞与計算!_xlnm.Print_Area,$A7,1)","v":"定額基礎"},{"$f":"INDEX(賞与計算!_xlnm.Print_Area,$A7,AE$1+1)","v":0},null,null,{"$f":"INDEX(賞与計算!_xlnm.Print_Area,$A7,1)","v":"定額基礎"},{"$f":"INDEX(賞与計算!_xlnm.Print_Area,$A7,AI$1+1)","v":0},null,null,{"$f":"INDEX(賞与計算!_xlnm.Print_Area,$A7,1)","v":"定額基礎"},{"$f":"INDEX(賞与計算!_xlnm.Print_Area,$A7,AM$1+1)","v":0}]
[15,{"$f":"INDEX(賞与計算!_xlnm.Print_Area,$A8,1)","v":"売上還元"},{"$f":"INDEX(賞与計算!_xlnm.Print_Area,$A8,C$1+1)","v":0},null,null,{"$f":"INDEX(賞与計算!_xlnm.Print_Area,$A8,1)","v":"売上還元"},{"$f":"INDEX(賞与計算!_xlnm.Print_Area,$A8,G$1+1)","v":0},null,null,{"$f":"INDEX(賞与計算!_xlnm.Print_Area,$A8,1)","v":"売上還元"},{"$f":"INDEX(賞与計算!_xlnm.Print_Area,$A8,K$1+1)","v":0},null,null,{"$f":"INDEX(賞与計算!_xlnm.Print_Area,$A8,1)","v":"売上還元"},{"$f":"INDEX(賞与計算!_xlnm.Print_Area,$A8,O$1+1)","v":0},null,null,{"$f":"INDEX(賞与計算!_xlnm.Print_Area,$A8,1)","v":"売上還元"},{"$f":"INDEX(賞与計算!_xlnm.Print_Area,$A8,S$1+1)","v":0},null,null,{"$f":"INDEX(賞与計算!_xlnm.Print_Area,$A8,1)","v":"売上還元"},{"$f":"INDEX(賞与計算!_xlnm.Print_Area,$A8,W$1+1)","v":0},null,null,{"$f":"INDEX(賞与計算!_xlnm.Print_Area,$A8,1)","v":"売上還元"},{"$f":"INDEX(賞与計算!_xlnm.Print_Area,$A8,AA$1+1)","v":0},null,null,{"$f":"INDEX(賞与計算!_xlnm.Print_Area,$A8,1)","v":"売上還元"},{"$f":"INDEX(賞与計算!_xlnm.Print_Area,$A8,AE$1+1)","v":0},null,null,{"$f":"INDEX(賞与計算!_xlnm.Print_Area,$A8,1)","v":"売上還元"},{"$f":"INDEX(賞与計算!_xlnm.Print_Area,$A8,AI$1+1)","v":0},null,null,{"$f":"INDEX(賞与計算!_xlnm.Print_Area,$A8,1)","v":"売上還元"},{"$f":"INDEX(賞与計算!_xlnm.Print_Area,$A8,AM$1+1)","v":0}]
{"$rows_left_out":24}
{"sheet":"振替伝票","index":6,"n_rows":22,"n_cols":10,"rows_kept":22,"cut":false,"hidden":false,"merged":[]}
["給与","項目名","金額","勘定科目","項目名","金額","勘定科目",null,"源泉所得税へ転記"]
[{"$f":"給与計算!B2","v":"2015-09-06T08:53:19.380"},"役員報酬",{"$f":"給与計算!M4","v":0},null,"当座預金",{"$f":"給与計算!M31","v":0},null,null,"総額",{"$f":"C10","v":0}]
[null,"給与",{"$f":"給与計算!M13-C2","v":0},null,"社会保険料",{"$f":"SUM(給与計算!M17:M18)","v":0},"預り金",null,"源泉所得税",{"$f":"F5","v":0}]
[null,"通勤費",{"$f":"給与計算!M14","v":0},"旅費交通費","雇用保険料",{"$f":"給与計算!M19","v":0},"預り金",null,"住民税",{"$f":"F6","v":0}]
[null,null,null,null,{"$f":"給与計算!B23","v":"源泉所得税"},{"$f":"給与計算!M23+給与計算!M24","v":0},"預り金",null,"社会保険料",{"$f":"F3","v":0}]
[null,null,null,null,{"$f":"給与計算!B25","v":"住民税"},{"$f":"給与計算!M25","v":0},"預り金"]
[null,null,null,null,{"$f":"給与計算!B26","v":"賄費"},{"$f":"給与計算!M26","v":0},"預り金"]
[null,null,null,null,{"$f":"T(給与計算!B27)","v":"寮費"},{"$f":"給与計算!M27","v":0},"立替金"]
{"$rows_left_out":15}
{"sheet":"保険料額表","index":7,"n_rows":55,"n_cols":13,"rows_kept":55,"cut":false,"hidden":false,"merged":[[0,8,0,9]]}
[null,"雇用保険",null,null,null,"健康保険",null,null,"厚生年金保険"]
[null,null,null,null,"更新日",null,"H27.4","H27.4","H26.9",null,null,"雇保","平成27年度雇用保険料率表"]
["等級","賃金額（以上）","保険料Ａ",null,"賃金額（以上）","等級","一般","介護保険","一般","月額"]
[null,null,5.0000000000000001E-3,null,"料率",null,9.9299999999999999E-2,0.11509999999999999,0.17474000000000001,null,null,"健保・厚年","平成27年度保険料額表"]
[null,null,null,null,"折半",null,{"$f":"G4/2","v":4.965E-2},{"$f":"H4/2","v":5.7549999999999997E-2},{"$f":"I4/2","v":8.7370000000000003E-2},null,null,"【端数処理】","給与から天引きの場合、一円未満の端数処理は、"]
[0,0,0,null,0,1,{"$f":"$J6*G$5*1000","v":2879.7000000000003},{"$f":"$J6*H$5*1000","v":3337.9},null,58,null,null,"50銭以下は切り捨て、50銭超えた場合に切り上げ"]
[1,92000,658,null,63,2,{"$f":"$J7*G$5*1000","v":3376.2},3913.3999999999996,null,68,null,null,"（四捨五入ではない）"]
[2,96000,686,null,73,3,3872.7,4488.9000000000005,null,78]
{"$rows_left_out":48}
{"sheet":"年末調整金種計算","index":8,"n_rows":39,"n_cols":13,"rows_kept":39,"cut":false,"hidden":false,"merged":[]}
[null,1,2,3,4,5,6,7,8,9,10]
[null,{"$f":"T(給与計算!C2)","v":"A"},{"$f":"T(給与計算!D2)","v":"B"},{"$f":"T(給与計算!E2)","v":"C"},{"$f":"T(給与計算!F2)","v":"D"},{"$f":"T(給与計算!G2)","v":"E"},{"$f":"T(給与計算!H2)","v":""},{"$f":"T(給与計算!I2)","v":""},{"$f":"T(給与計算!J2)","v":""},{"$f":"T(給与計算!K2)","v":""},{"$f":"T(給与計算!L2)","v":""},"合計"]
["還付額",{"$f":"IF(B19>0,B19,0)","v":{"$error":"#REF!"}},{"$error":"#REF!"},{"$error":"#REF!"},{"$error":"#REF!"},{"$f":"IF(F19>0,F19,0)","v":{"$error":"#REF!"}},0,0,0,0,0,{"$f":"SUM(B3:K3)","v":{"$error":"#REF!"}},{"$f":"IF(M6=L3,\"OK\",\"NO\")","v":{"$error":"#REF!"}}]
["不足額",{"$f":"-IF(B19>0,0,B19)","v":{"$error":"#REF!"}},{"$error":"#REF!"},{"$error":"#REF!"},{"$error":"#REF!"},{"$f":"-IF(F19>0,0,F19)","v":{"$error":"#REF!"}},0,0,0,0,0,{"$f":"SUM(B4:K4)","v":{"$error":"#REF!"}}]
[]
["金種明細",null,null,null,null,null,null,null,null,null,null,"合計",{"$f":"SUM(M7:M15)","v":{"$error":"#REF!"}}]
[10000,{"$f":"B22","v":{"$error":"#REF!"}},{"$error":"#REF!"},{"$error":"#REF!"},{"$error":"#REF!"},{"$f":"F22","v":{"$error":"#REF!"}},0,0,0,0,0,{"$f":"SUM(B7:K7)","v":{"$error":"#REF!"}},{"$f":"L7*A7","v":{"$error":"#REF!"}}]
[5000,{"$f":"B24","v":{"$error":"#REF!"}},{"$error":"#REF!"},{"$error":"#REF!"},{"$error":"#REF!"},{"$f":"F24","v":{"$error":"#REF!"}},0,0,0,0,0,{"$error":"#REF!"},{"$f":"L8*A8","v":{"$error":"#REF!"}}]
{"$rows_left_out":32}
{"sheet":"台帳合計表","index":9,"n_rows":35,"n_cols":20,"rows_kept":35,"cut":false,"hidden":false,"merged":[[2,2,2,3],[1,2,1,3],[0,2,0,3]]}
[{"$f":"DATEVALUE(従業者名簿!B3&\"/1/1\")","v":"2015-01-01"}]
[]
[]
[]
[{"$f":"A1","v":42005},"１月","２月","３月","４月","５月","６月","７月","８月","９月","10月","11月","12月","合計",null,null,"夏期賞与","冬期賞与","賞与合計"]
["基本給与",null,null,null,null,null,null,null,null,null,null,null,null,{"$f":"SUM(B6:M6)","v":0},null,"定額基礎",null,null,{"$f":"SUM(Q6:R6)","v":0}]
["役員報酬",null,null,null,null,null,null,null,null,null,null,null,null,{"$f":"SUM(B7:M7)","v":0},null,"売上還元",null,null,{"$f":"SUM(Q7:R7)","v":0}]
["家族手当",null,null,null,null,null,null,null,null,null,null,null,null,0,null,"能力還元",null,null,{"$f":"SUM(Q8:R8)","v":0}]
{"$rows_left_out":28}
{"sheet":"台帳原本","index":10,"n_rows":49,"n_cols":27,"rows_kept":49,"cut":false,"hidden":false,"merged":[[40,6,40,7],[1,24,2,24],[2,22,2,23],[6,21,7,21],[0,23,0,24],[40,13,40,14],[1,21,2,21],[1,22,1,23]]}
[null,"氏名","(氏名)",null,null,null,"生年月日",null,{"$f":"IF(H1=\"\",\"\",\"（\"&U2&\"才）\")","v":""},null,{"$f":"従業者名簿!C5","v":"従業者番号"},"(従業員番号)",null,"入社日",null,"退職日",null,null,null,"区分",null,null,null,"給与支払報告書",null,null,{"$f":"A5","v":42005}]
[null,"住所","(郵便番号)","(住所１)",null,null,"電話","(電話番号)",null,null,{"$f":"従業者名簿!M5","v":"基礎年金番号"},"(基礎年金番号)",null,null,null,null,null,null,null,"年齢",{"$f":"DATEDIF(H1,台帳合計表!A1,\"Y\")","v":115},"住所",{"$f":"T(D2)","v":"(住所１)"},null,"氏名",{"$f":"T(E1)","v":""},"（お）"]
[null,null,null,"(住所２)",null,null,null,null,null,null,{"$f":"従業者名簿!N5","v":"介護保険"},"(介護保険)",null,null,null,null,null,null,null,null,null,null,{"$f":"T(D3)","v":"(住所２)"},null,null,{"$f":"T(C1)","v":"(氏名)"},{"$f":"L1","v":"(従業員番号)"}]
[null,"振込先","(振込先)",null,null,null,null,null,null,null,{"$f":"従業者名簿!O5","v":"雇用保険番号"},"(雇用保険番号)",null,null,null,null,null,null,null,null,null,"種別","（Ａ）支払金額","（Ｂ）控除後","所得控除合計","（き）徴収税額"]
[{"$f":"台帳合計表!A1","v":42005},"１月","２月","３月","４月","５月","６月","７月","８月","９月","10月","11月","12月","合計",null,null,"夏期賞与","冬期賞与","賞与合計",null,null,"給与・賞与",{"$f":"H37","v":0},{"$f":"IF(V10=0,H39,0)","v":0},{"$f":"IF(V10=0,L44,)","v":380000},{"$f":"IF(V10=0,P42,H38)","v":0}]
["基本給与",null,null,null,null,null,null,null,null,null,null,null,null,{"$f":"SUM(B6:M6)","v":0},null,"定額基礎",null,null,{"$f":"SUM(Q6:R6)","v":0},null,null,"配偶者",{"$f":"IF(B38=1,\"有\",\"無\")&\"｜\"&IF(B38=2,\"老\",\"\")","v":"無｜"},"配特",{"$f":"L42","v":0},"扶養親族",{"$f":"IF(B39>0,\"その他(\"&B39&\")\",\"\")&IF(B40>0,\"特定(\"&B40&\")\",\"\")&IF(B41>0,\"年少(\"&B41&\")\",\"\")&IF(B42>0,\"同老(\"&B42&\")\",\"\")&IF(B43>0,\"他(\"&B43&\")\",\"\")","v":""}]
["役員報酬",null,null,null,null,null,null,null,null,null,null,null,null,0,null,"売上還元",null,null,{"$f":"SUM(Q7:R7)","v":0},null,null,"控除額","（Ｎ）社保","（Ｏ）生命保険","（Ｐ）損害保険","（く）住宅控除","年調定率控除額"]
["家族手当",null,null,null,null,null,null,null,null,null,null,null,null,0,null,"能力還元",null,null,{"$f":"SUM(Q8:R8)","v":0},null,null,null,{"$f":"L37","v":0},{"$f":"IF(V10=0,L40,0)","v":0},{"$f":"IF(V10=0,L41,0)","v":0},{"$f":"IF(V10=0,P40,0)","v":0},{"$f":"IF(V10=0,-P41,0)","v":0}]
{"$rows_left_out":42}
{"sheet":"賞与算出表","index":11,"n_rows":21,"n_cols":9,"rows_kept":21,"cut":false,"hidden":false,"merged":[[0,1,0,8],[1,1,1,8]]}
[null,"賞与に対する源泉徴収税額の算出率の表"]
[null,"（所得税等負担軽減措置法別表第三）"]
["扶養者数",0,1,2,3,4,5,6,7]
[0,0,0,0,0,0,0,0,0]
[2,65,89,123,159,195,228,259,289]
[4,71,98,140,180,219,254,288,322]
[6,77,115,248,248,248,286,324,363]
[8,85,365,393,417,441,465,488,512]
{"$rows_left_out":14}
{"sheet":"年末調整計算","index":12,"n_rows":48,"n_cols":6,"rows_kept":48,"cut":false,"hidden":false,"merged":[[0,0,0,3]]}
["年末調整のための計算表",null,null,null,"2015.1改訂"]
[]
["扶養控除","基礎控除",null,380000]
[null,"配偶者控除","一般",380000]
[null,null,"老人",480000]
[null,"一般扶養親族",null,380000]
[null,"特定扶養親族",null,630000,"16歳以上23歳未満"]
[null,"年少扶養親族",null,null,"16歳未満"]
{"$rows_left_out":40}